professional development
type: Concept
narrower: reading recovery

reading recovery
definition: Reading Recovery is a school-based literacy intervention for first-grade students having the greatest difficulty learning to read and write. According to evidence from longitudinal research, children who struggle with reading in the early years are very likely to continue struggling in later years. [Source: Encyclopedia of Educational Reform and Dissent; Reading Recovery]
broader: professional development
type: Concept

concepts
type: Collection
type: ConceptGroup
member: reading recovery