regulations
type: Concept
narrower: reform and regulation

concepts
type: Collection
type: ConceptGroup
member: reform and regulation

reform and regulation
definition: Regulation can be defined as any attempt by government to control the economic behavior of individuals and corporations. It typically involves the imposition of official standards and rules on some form of business activity, accompanied by an enforcement mechanism and some type of sanction. [Source: Encyclopedia of White-Collar and Corporate Crime; Reform and Regulation]
broader: regulations
type: Concept