population crises
type: Concept
narrower: refugees and forced migration

refugees and forced migration
definition: What primarily distinguishes refugees and forced migrants from any other migrants is the fact that they flee a specific situation of crisis. These catalysts can be political in nature, such as the Bosnian war in the 1990s, or environmental, such as the drought in east Africa that began roughly in mid-2011. [Source: Encyclopedia of Crisis Management; Refugees and Forced Migration]
broader: population crises
type: Concept

concepts
type: Collection
type: ConceptGroup
member: refugees and forced migration