concepts
type: Collection
type: ConceptGroup
member: reincarnation

reincarnation
definition: Reincarnation (also called transmigration or metempsychosis) is the religious or philosophical view that humans, and possibly also animals and plants, have multiple existences. This view is most prevalent in Asian religions of Indian origin, such as Hinduism, Jainism, Buddhism, and Sikhism. [Source: Encyclopedia of Time: Science, Philosophy, Theology, & Culture; Reincarnation]
broader: religion
type: Concept

religion
type: Concept
narrower: reincarnation