representation and electoral systems
type: Concept
narrower: representative systems

representative systems
definition: Extant democracies are based on representation: decisions are taken by politicians, elected and regularly controlled by citizens. In this process, political parties play a crucial role. [Source: The Encyclopedia of Political Science; Representative Systems]
broader: representation and electoral systems
type: Concept

concepts
type: Collection
type: ConceptGroup
member: representative systems