behavioral aspects of housing
type: Concept
narrower: residential preferences

concepts
type: Collection
type: ConceptGroup
member: residential preferences

residential preferences
definition: Residential preferences reflect desired types of housing situations and encompass many dimensions of housing, including structural type, tenure, location, neighborhood housing and population composition, and political jurisdiction. Determining the type of housing that people want is important for several reasons. [Source: The Encyclopedia of Housing; Residential Preferences]
broader: behavioral aspects of housing
type: Concept