eyewitness memory
type: Concept
narrower: response latency in eyewitness identification

response latency in eyewitness identification
definition: An important issue for the police and courts is the extent to which an eyewitness's decision about a lineup can be trusted as accurate. Consequently, psychologists have searched for variables associated with the witness's decision that help distinguish correct from incorrect decisions. [Source: Encyclopedia of Psychology and Law; Response Latency in Eyewitness Identification]
broader: eyewitness memory
type: Concept

concepts
type: Collection
type: ConceptGroup
member: response latency in eyewitness identification