concepts
type: Collection
type: ConceptGroup
member: restorative policing

problem-oriented policing
type: Concept
narrower: restorative policing

restorative policing
definition: DefinitionRestorative policing is a problem-oriented, community style of policing that aims to resolve conflict in civil society more amicably and sensitively without always resorting to strict law enforcement. It calls on police officers to exercise their judgement and use negotiation and persuasion to resolve problems. [Source: The SAGE Dictionary of Policing; Restorative Policing]
broader: problem-oriented policing
type: Concept