retention programs
definition: In the first half of the twentieth century, employment careers were often characterized by long periods of stable, uninterrupted employment at a single firm. However, contemporary career models are becoming more episodic in nature. [Source: Encyclopedia of Career Development; Retention Programs]
broader: career development initiatives
type: Concept

career development initiatives
type: Concept
narrower: retention programs

concepts
type: Collection
type: ConceptGroup
member: retention programs