theories
type: Concept
narrower: rhetorical theory

rhetorical theory
definition: Rhetorical theory is the body of thought about human symbol use. The term rhetoric, in its popular usage, typically has negative connotations. [Source: Encyclopedia of Communication Theory; Rhetorical Theory]
broader: theories
type: Concept

concepts
type: Collection
type: ConceptGroup
member: rhetorical theory