risk appraisal
definition: Definition The term risk appraisal refers to an evaluation of the chances that a future event may occur. Similar terms include risk assessment, risk perception, perceived likelihood, and perception of vulnerability. [Source: Encyclopedia of Social Psychology; Risk Appraisal]
broader: social cognition
type: Concept

social cognition
type: Concept
narrower: risk appraisal

concepts
type: Collection
type: ConceptGroup
member: risk appraisal