classification and risk assessment
type: Concept
narrower: risk assessment instruments: three generations

concepts
type: Collection
type: ConceptGroup
member: risk assessment instruments: three generations

risk assessment instruments: three generations
definition: The criminal justice system supervises more than 7 million offenders of all ages, from diverse backgrounds, and with a variety of individual needs. A one-size-fits-all approach to correctional treatment would be ineffective and irresponsible. [Source: Encyclopedia of Community Corrections; Risk Assessment Instruments: Three Generations]
broader: classification and risk assessment
type: Concept