risk treatment
definition: Risk treatment is the process of identification, selection, and implementation of appropriate measures aiming to modify the likelihood of occurrence or the impact of a risk. This process follows the stages of risk identification and assessment in the risk management cycle. [Source: Encyclopedia of Crisis Management; Risk Treatment]
broader: issues in crisis management
type: Concept

concepts
type: Collection
type: ConceptGroup
member: risk treatment

issues in crisis management
type: Concept
narrower: risk treatment