routine emergencies versus true crises
definition: Routine emergencies are incidents that threaten life, health, property, or the environment and require remedial actions to prevent further damage. Emergencies develop quickly and have tangible effects that must be remedied to minimize harm. [Source: Encyclopedia of Crisis Management; Routine Emergencies Versus True Crises]
broader: issues in crisis management
type: Concept

concepts
type: Collection
type: ConceptGroup
member: routine emergencies versus true crises

issues in crisis management
type: Concept
narrower: routine emergencies versus true crises