community-based housing
type: Concept
narrower: rural housing

concepts
type: Collection
type: ConceptGroup
member: rural housing

rural housing
definition: Defining rural housing is difficult. Federal policy uses multiple definitions for rural places based on population density and geographic areas. [Source: The Encyclopedia of Housing; Rural Housing]
broader: community-based housing
type: Concept