population
type: Concept
narrower: savants

concepts
type: Collection
type: ConceptGroup
member: savants

savants
definition: The term savant is borrowed from the French as a derivative of the verb savoir, which means “to know.” Savant means “learned person” or “eminent scholar” and it has been in circulation in English with a similar meaning since the 1800s. Its first use as part of the phrase idiot savant is jointly attributed to John Langdon Down, the physician who also identified the genetic disorder known as Down syndrome, and to Alfred Binet, the inventor of first intelligence test. [Source: Encyclopedia of Giftedness, Creativity, and Talent; Savants]
broader: population
type: Concept