school mobility and education
definition: Over the course of a student's education, they may change schools several times. The normal progression of change is from elementary to middle to high school, which can provide challenges for the average child. [Source: Sociology of Education: An A-to-Z Guide; School Mobility and Education]
broader: education beyond schools
type: Concept

concepts
type: Collection
type: ConceptGroup
member: school mobility and education

education beyond schools
type: Concept
narrower: school mobility and education