service provider
definition: Service provider refers to all those organizational entities or individuals that are directly involved in the delivery of a vast range of services to clients, consumers, or citizens at private or public levels. The term refers to a variety of forms of ownership and structures; it is broad enough to encompass individual and organizational providers, governmental and nongovernmental organizations, for-profit and nonprofit entities, and professionals and nonprofessionals. [Source: Encyclopedia of Governance; Service Provider]
broader: public-sector management
type: Concept

public-sector management
type: Concept
narrower: service provider

concepts
type: Collection
type: ConceptGroup
member: service provider