sexual standards
definition: Sexual standards are attitudes about appropriate sexual behaviors. They are typically measured by asking people to agree or disagree with statements about the acceptability of particular kinds of behaviors, for each gender, at different stages of a relationship. [Source: Encyclopedia of Human Relationships; Sexual Standards]
broader: sexuality
type: Concept

sexuality
type: Concept
narrower: sexual standards

concepts
type: Collection
type: ConceptGroup
member: sexual standards