situated agency
definition: Situated agency has to do with the relationship between conduct and context involving meaningful human actions. Central to giving an explanatory account of human behavior and social practices, whether explicitly or implicitly, is a conception of the relationship between concepts and practices, meaning and action. [Source: Encyclopedia of Governance; Situated Agency]
broader: interpretive theory
type: Concept

interpretive theory
type: Concept
narrower: situated agency

concepts
type: Collection
type: ConceptGroup
member: situated agency