slapjack
definition: Slapjack is a children's card game. It bears some resemblance to some of the “Egyptian” variations of Beggar My Neighbor. [Source: Encyclopedia of Play in Today's Society; Slapjack]
broader: card games
type: Concept

concepts
type: Collection
type: ConceptGroup
member: slapjack

card games
type: Concept
narrower: slapjack