social audits
definition: Social auditing refers to the process of identifying, analyzing, measuring, evaluating, and monitoring the impact of an organization's operations on different stakeholder groups. The auditing process is carried out in five steps. [Source: Encyclopedia of Business Ethics and Society; Social Audits]
broader: management ethics
type: Concept

concepts
type: Collection
type: ConceptGroup
member: social audits

management ethics
type: Concept
narrower: social audits