concepts
type: Collection
type: ConceptGroup
member: social efficiency tradition

social efficiency tradition
definition: Social efficiency defies a single definition, but the idea that a good curriculum should result in a harmonious, well-functioning, and balanced society is a theme found in the work of all writers who used the term social efficiency. The phrase was popular during the first few decades of the 20th century. [Source: Encyclopedia of Curriculum Studies; Social Efficiency Tradition]
broader: theoretical perspectives
type: Concept

theoretical perspectives
type: Concept
narrower: social efficiency tradition