social internet use
definition: The Internet's appeal for adolescents has a strong social component. The growing technology has spawned a diversity of ways in which children and adolescents can communicate through the Internet. [Source: Encyclopedia of Children, Adolescents, and the Media; Internet Use, Social]
broader: computers and electronic media
type: Concept

computers and electronic media
type: Concept
narrower: social internet use

concepts
type: Collection
type: ConceptGroup
member: social internet use