sociometric assessment
definition: Sociometric assessment is the measurement of interpersonal relationships in a social group. Sociometric measurement or assessment methods provide information about an individual's social status, which is their social standing within a group. [Source: Encyclopedia of School Psychology; Sociometric Assessment]
broader: assessment
type: Concept

assessment
type: Concept
narrower: sociometric assessment

concepts
type: Collection
type: ConceptGroup
member: sociometric assessment