socnet
definition: SOCNET is the official LISTSERV e-mail list of the International Network for Social Network Analysis (INSNA). LISTSERV, is a trademarked, automated mail forwarding system in which subscribers send mail to a central address and it is automatically rebroadcast to all other subscribers. [Source: Encyclopedia of Social Networks; SOCNET]
broader: technology and social networking
type: Concept

technology and social networking
type: Concept
narrower: socnet

concepts
type: Collection
type: ConceptGroup
member: socnet