global conflict and security
type: Concept
narrower: soft power diplomacy

soft power diplomacy
definition: Soft power diplomacy has played a major role in geopolitics in the global age. Soft power diplomacy refers to the application of techniques of diplomacy by diplomats as a means of exercising soft power in the pursuit of foreign policy or other national objectives. [Source: Encyclopedia of Global Studies; Soft Power Diplomacy]
broader: global conflict and security
type: Concept

concepts
type: Collection
type: ConceptGroup
member: soft power diplomacy