solitaire and variations of
definition: Solitaire is a group of card games whose name comes from the French word meaning patience. Patience is the name used for solitaire in Great Britain and elsewhere. [Source: Encyclopedia of Play in Today's Society; Solitaire and Variations of]
broader: card games
type: Concept

concepts
type: Collection
type: ConceptGroup
member: solitaire and variations of

card games
type: Concept
narrower: solitaire and variations of