spatial query
definition: A spatial query is a means of accessing the geometry, attributes, and relationships of spatial features within a spatial database. Access to information in a database involves formulating a question (query) to put forward a request for the desired information. [Source: Encyclopedia of Geographic Information Science; Spatial Query]
broader: data manipulation
type: Concept

methods
type: Collection
type: ConceptGroup
member: spatial query

data manipulation
type: Concept
narrower: spatial query