split-half reliability
definition: A way to check the ∗internal consistency (or ∗reliability) of an ∗index by seeing how well the scores on one half of the items ∗correlate with those on the other half. Compare ∗Cronbach's alpha, ∗KR20. [Source: Dictionary of Statistics & Methodology; Split-Half Reliability]
broader: reliability (research methods)
type: Concept

methods
type: Collection
type: ConceptGroup
member: split-half reliability

reliability (research methods)
type: Concept
narrower: split-half reliability