concepts
type: Collection
type: ConceptGroup
member: spoil five

spoil five
definition: Spoil Five is a card game played with a traditional 52-card deck. Irish in origin, there may be some significance in the fact that the Gaelic word for “five” and “trick” is the same: cuig. [Source: Encyclopedia of Play in Today's Society; Spoil Five]
broader: card games
type: Concept

card games
type: Concept
narrower: spoil five