social cognition
type: Concept
narrower: spontaneous trait inferences

spontaneous trait inferences
definition: Definition The notion of spontaneous trait inferences (STIs) refers to a frequently demonstrated empirical finding. Observing behaviors or reading behavior descriptions gives rise to immediate trait inferences, beyond the actually given information. [Source: Encyclopedia of Social Psychology; Spontaneous Trait Inferences]
broader: social cognition
type: Concept

concepts
type: Collection
type: ConceptGroup
member: spontaneous trait inferences