stem cell controversy
definition: Stem cells are utility and repair units of the body that serve a central function in the maintenance and regeneration of organs and tissues throughout life. Adult stem cells (ASC) derived from tissue sources such as bone marrow have been used in various medical therapies for several decades. [Source: Encyclopedia of Science and Technology Communication; Stem Cell Controversy]
broader: challenges, issues, and controversies
type: Concept

challenges, issues, and controversies
type: Concept
narrower: stem cell controversy

concepts
type: Collection
type: ConceptGroup
member: stem cell controversy