waste issues and solutions
type: Concept
narrower: street sweeping

concepts
type: Collection
type: ConceptGroup
member: street sweeping

street sweeping
definition: Street sweeping collects a tremendous amount of waste off roads and parking lots across the world. The waste is highly heterogeneous and varies geographically from region to region. [Source: Encyclopedia of Consumption and Waste: The Social Science of Garbage; Street Sweeping]
broader: waste issues and solutions
type: Concept