subintentional death
definition: Within the death and dying literature, subintentional is defined as indirectly or unconsciously causing one's own death. Many experts such as Normal Farberow, cofounder of the Los Angeles Suicide Prevention Center, believe that subintentional death and suicide exist along a continuum. [Source: Encyclopedia of Death and the Human Experience; Subintentional Death]
broader: cause of death
type: Concept

concepts
type: Collection
type: ConceptGroup
member: subintentional death

cause of death
type: Concept
narrower: subintentional death