housing
type: Concept
narrower: supported housing

supported housing
definition: Supported housing is a model that merges both housing and services to sustain such housing. While this model can be used for a variety of circumstances, this entry will focus on supported housing for those with mental illness, developmental and intellectual disabilities, and addictions, and as a solution aiding those who were formerly homeless. [Source: Encyclopedia of Human Services and Diversity; Supported Housing]
broader: housing
type: Concept

concepts
type: Collection
type: ConceptGroup
member: supported housing