concepts
type: Collection
type: ConceptGroup
member: tabloids

tabloids
definition: Tabloid has two meanings. First, it is used for a small newspaper format, roughly half the size of the ordinary broadsheet. [Source: Encyclopedia of Political Communication; Tabloids]
broader: media
type: Concept

media
type: Concept
narrower: tabloids