tacit skills
definition: Workplace knowledge and skill is a central concept in the sociology of work. Much of the research examining workplace knowledge and skill, however, focuses only on explicit skill or knowledge—skills that are recognized, codified, and compensated in the labor market. [Source: Sociology of Work: An Encyclopedia; Tacit Skills]
broader: occupations and professions, labor processes, jobs, and careers
type: Concept

concepts
type: Collection
type: ConceptGroup
member: tacit skills

occupations and professions, labor processes, jobs, and careers
type: Concept
narrower: tacit skills