representation and electoral systems
type: Concept
narrower: tactical voting

tactical voting
definition: Tactical voting, also known as strategic voting, is considered the opposite of sincere voting. Tactical voting occurs when voters do not choose their genuinely preferred candidates, but instead vote for their alternative candidates in order to help prevent an undesirable election outcome. [Source: The Encyclopedia of Political Science; Tactical Voting]
broader: representation and electoral systems
type: Concept

concepts
type: Collection
type: ConceptGroup
member: tactical voting