target population
definition: The terms statistical population, population of interest, universe, and simply population are often used interchangeably when referring to a target population. What they have in common is that they define a group of people or other units that are the focus of a study and to whom the results are intended to generalize. [Source: Encyclopedia of Epidemiology; Target Population]
broader: statistics and research methods
type: Concept

methods
type: Collection
type: ConceptGroup
member: target population

statistics and research methods
type: Concept
narrower: target population