targeting
definition: identifying, evaluating, prioritizing, and selecting the specific audience(s) that will be the focus of the marketer's communications program. [Source: Dictionary of Marketing Communications; Targeting]
broader: market segmentation
type: Concept

market segmentation
type: Concept
narrower: targeting

concepts
type: Collection
type: ConceptGroup
member: targeting