international trade
type: Concept
narrower: tariff

concepts
type: Collection
type: ConceptGroup
member: tariff

tariff
definition: A tariff is a tax on imports. Tariffs are typically used for two reasons: to raise tax revenues and to protect domestic industries. [Source: Encyclopedia of Business in Today's World; Tariff]
broader: international trade
type: Concept