economics and ethics
type: Concept
narrower: tariffs and quotas

tariffs and quotas
definition: Tariffs are taxes imposed on foreign-made goods (imports) coming into a country. The tax (also referred to as a duty) raises the price of the good. [Source: Encyclopedia of Business Ethics and Society; Tariffs and Quotas]
broader: economics and ethics
type: Concept

concepts
type: Collection
type: ConceptGroup
member: tariffs and quotas