tasers
definition: Taser is an acronym for the Tom A. Swift Electronic Rifle. It is a brand name for an electronic device for the control of people. [Source: Encyclopedia of Race and Crime; Tasers]
broader: police
type: Concept

police
type: Concept
narrower: tasers

concepts
type: Collection
type: ConceptGroup
member: tasers