counseling (general)
type: Concept
narrower: taxonomy of helpful impacts

taxonomy of helpful impacts
definition: Psychologists have made systematic efforts to identify the relation of events that occur during therapy to the beneficial outcomes clients report. This critical topic is addressed by every theory of psychotherapy, and well over a thousand studies of the efficacy of therapeutic interventions have been published during the last seven decades. [Source: Encyclopedia of Counseling; Taxonomy of Helpful Impacts]
broader: counseling (general)
type: Concept

concepts
type: Collection
type: ConceptGroup
member: taxonomy of helpful impacts