inquiry and research
type: Concept
narrower: teacher lore research

concepts
type: Collection
type: ConceptGroup
member: teacher lore research

teacher lore research
definition: Teacher lore research is a form of narrative inquiry based on rich teaching accounts written by or about the teacher involved. Through these contextualized accounts, collectors of teacher lore hold that teachers will discover their own theory through sharing their own voices as they reveal their beliefs, understandings, and knowledge. [Source: Encyclopedia of Curriculum Studies; Teacher Lore Research]
broader: inquiry and research
type: Concept