teaching about English language variations
definition: This entry focuses on the practice of helping educators and students understand English language variations—the ways in which spoken, written, and signed varieties of English intersect with societal, educational, and economic correlates. Language variation permeates all aspects of diversity in education, including the types of materials that are used to teach students; how students are assessed; and the relationship in the classroom between students and teachers, especially with respect to school discipline. [Source: Encyclopedia of Diversity in Education; English Language Variations, Teaching About]
broader: language diversity
type: Concept

concepts
type: Collection
type: ConceptGroup
member: teaching about English language variations

language diversity
type: Concept
narrower: teaching about English language variations