teaching strategies
definition: Teaching strategies are the procedures, processes, activities, and tools used to assist in learning. These strategies encompass a wide range of approaches and actions and are situated across a variety of contexts. [Source: Encyclopedia of Educational Psychology; Teaching Strategies]
broader: teaching
type: Concept

teaching
type: Concept
narrower: teaching strategies

concepts
type: Collection
type: ConceptGroup
member: teaching strategies