concepts
type: Collection
type: ConceptGroup
member: television dramas

television dramas
definition: The category “television drama” includes episodic crime series and nongenre series that have a strong criminal justice component. Examples of the latter include the nongenre series I'll Fly Away (NBC, 1991–1993). [Source: Encyclopedia of Race and Crime; Television Dramas]
broader: media
type: Concept

media
type: Concept
narrower: television dramas