test adaptation/translation methods
definition: Introduction During the decades the interest in cross-cultural studies has increased. These studies involve groups without a common language. [Source: Encyclopedia of Psychological Assessment; Test Adaptation/Translation Methods]
broader: theory and methodology
type: Concept

theory and methodology
type: Concept
narrower: test adaptation/translation methods

methods
type: Collection
type: ConceptGroup
member: test adaptation/translation methods